Reaction Details
TargetMelanin-concentrating hormone receptor 1
LigandBDBM50301081
Substrate/Competitorn/a
Meas. Tech.ChEMBL_699748 (CHEMBL1648561)
IC50 5.6±n/a nM
Citation Haga, YMizutani, SNaya, AKishino, HIwaasa, HIto, MIto, JMoriya, MSato, NTakenaga, NIshihara, ATokita, SKanatani, AOhtake, N Discovery of novel phenylpyridone derivatives as potent and selective MCH1R antagonists. Bioorg Med Chem19:883-93 (2011) 
 
Melanin-concentrating hormone receptor 1
Name:Melanin-concentrating hormone receptor 1
Type:G Protein-Coupled Receptor (GPCR)
Mol. Mass.:45976.27
Organism:Homo sapiens (Human)
Description:Membranes from CHO-K1 cells stably expressing human MCH1R were used in assays.
Residue:422
BDBM50301081
NameBDBM50301081
Synonyms:4-(4-fluorobenzyloxy)-1-(4-(2-(pyrrolidin-1-yl)ethoxy)phenyl)pyridin-2(1H)-one | CHEMBL584538
TypeSmall organic molecule
Emp. Form.C24H25FN2O3
Mol. Mass.408.4653
SMILESFc1ccc(COc2ccn(-c3ccc(OCCN4CCCC4)cc3)c(=O)c2)cc1