Reaction Details
TargetAurora kinase A
LigandBDBM14192
Substrate/Competitorn/a
Meas. Tech.ChEMBL_700207 (CHEMBL1647308)
IC50 0.6±n/a nM
Citation Morshed, MNCho, YSSeo, SHHan, KCYang, EGPae, AN Computational approach to the identification of novel Aurora-A inhibitors. Bioorg Med Chem19:907-16 (2011) 
 
Aurora kinase A
Name:Aurora kinase A
Type:Serine/threonine-protein kinase
Mol. Mass.:45830.98
Organism:Homo sapiens (Human)
Description:O14965
Residue:403
BDBM14192
NameBDBM14192
Synonyms:3-({7-cyclohexyl-7H-pyrrolo[2,3-d]pyrimidin-2-yl}amino)benzoic acid | pyrrolopyrimidine 15
TypeSmall organic molecule
Emp. Form.C19H20N4O2
Mol. Mass.336.3877
SMILESOC(=O)c1cccc(Nc2ncc3ccn(C4CCCCC4)c3n2)c1