Reaction Details
TargetAurora kinase A
LigandBDBM50333659
Substrate/Competitorn/a
Meas. Tech.ChEMBL_700207 (CHEMBL1647308)
IC50>100000±n/a nM
Citation Morshed, MNCho, YSSeo, SHHan, KCYang, EGPae, AN Computational approach to the identification of novel Aurora-A inhibitors. Bioorg Med Chem19:907-16 (2011) 
 
Aurora kinase A
Name:Aurora kinase A
Type:Serine/threonine-protein kinase
Mol. Mass.:45830.98
Organism:Homo sapiens (Human)
Description:O14965
Residue:403
BDBM50333659
NameBDBM50333659
Synonyms:6-(3,4-dimethoxyphenyl)-N-(2,4-dimethylphenyl)-3-phenyl-2H-pyrazolo[3,4-b]pyridine-4-carboxamide | CHEMBL1643137
TypeSmall organic molecule
Emp. Form.C29H26N4O3
Mol. Mass.478.5417
SMILESCOc1ccc(cc1OC)-c1cc(C(=O)Nc2ccc(C)cc2C)c2c(n[nH]c2n1)-c1ccccc1