Reaction Details
TargetAurora kinase A
LigandBDBM50333664
Substrate/Competitorn/a
Meas. Tech.ChEMBL_700207 (CHEMBL1647308)
IC50 11940±n/a nM
Citation Morshed, MNCho, YSSeo, SHHan, KCYang, EGPae, AN Computational approach to the identification of novel Aurora-A inhibitors. Bioorg Med Chem19:907-16 (2011) 
 
Aurora kinase A
Name:Aurora kinase A
Type:Serine/threonine-protein kinase
Mol. Mass.:45830.98
Organism:Homo sapiens (Human)
Description:O14965
Residue:403
BDBM50333664
NameBDBM50333664
Synonyms:2-amino-N-(3-(4-hydroxyphenyl)-1-oxo-1-(p-tolylamino)propan-2-yl)benzamide | CHEMBL1643145
TypeSmall organic molecule
Emp. Form.C23H23N3O3
Mol. Mass.389.447
SMILESCc1ccc(NC(=O)C(Cc2ccc(O)cc2)NC(=O)c2ccccc2N)cc1