Reaction Details
TargetCarbonic anhydrase
LigandBDBM29277
Substrate/Competitorn/a
Meas. Tech.ChEMBL_700659 (CHEMBL1645698)
Ki 294±n/a nM
Citation Bertucci, AInnocenti, AScozzafava, ATambutté, SZoccola, DSupuran, CT Carbonic anhydrase inhibitors. Inhibition studies with anions and sulfonamides of a new cytosolic enzyme from the scleractinian coral Stylophora pistillata. Bioorg Med Chem Lett21:710-4 (2011) 
 
Carbonic anhydrase
Name:Carbonic anhydrase
Synonyms:n/a
Type:PROTEIN
Mol. Mass.:35119.71
Organism:Stylophora pistillata
Description:ChEMBL_700659
Residue:316
BDBM29277
NameBDBM29277
TypeSmall organic molecule
Emp. Form.C9H11NO4S
Mol. Mass.229.253
SMILESNS(=O)(=O)c1ccc(CCC(O)=O)cc1