Reaction Details
TargetCarbonic anhydrase
LigandBDBM10879
Substrate/Competitorn/a
Meas. Tech.ChEMBL_700659 (CHEMBL1645698)
Ki 650±n/a nM
Citation Bertucci, AInnocenti, AScozzafava, ATambutté, SZoccola, DSupuran, CT Carbonic anhydrase inhibitors. Inhibition studies with anions and sulfonamides of a new cytosolic enzyme from the scleractinian coral Stylophora pistillata. Bioorg Med Chem Lett21:710-4 (2011) 
 
Carbonic anhydrase
Name:Carbonic anhydrase
Synonyms:n/a
Type:PROTEIN
Mol. Mass.:35119.71
Organism:Stylophora pistillata
Description:ChEMBL_700659
Residue:316
BDBM10879
NameBDBM10879
TypeSmall organic molecule
Emp. Form.C6H9N3O2S
Mol. Mass.187.22
SMILESNNc1ccccc1S(N)(=O)=O