Reaction Details
TargetCarbonic anhydrase 6
LigandBDBM10879
Substrate/Competitorn/a
Meas. Tech.ChEMBL_700657 (CHEMBL1645696)
Ki 1090±n/a nM
Citation Bertucci, AInnocenti, AScozzafava, ATambutté, SZoccola, DSupuran, CT Carbonic anhydrase inhibitors. Inhibition studies with anions and sulfonamides of a new cytosolic enzyme from the scleractinian coral Stylophora pistillata. Bioorg Med Chem Lett21:710-4 (2011) 
 
Carbonic anhydrase 6
Name:Carbonic anhydrase 6
Type:Enzyme
Mol. Mass.:35371.40
Organism:Homo sapiens (Human)
Description:P23280
Residue:308
BDBM10879
NameBDBM10879
Synonyms:2-Hydrazinobenzenesulfonamide CHEMBL176495 hydrazide deriv. 18
TypeSmall organic molecule
Emp. Form.C6H9N3O2S
Mol. Mass.187.22
SMILESNNc1ccccc1S(N)(=O)=O