Reaction Details
TargetCarbonic anhydrase
LigandBDBM29277
Substrate/Competitorn/a
Meas. Tech.ChEMBL_700658 (CHEMBL1645697)
Ki 256±n/a nM
Citation Bertucci, AInnocenti, AScozzafava, ATambutté, SZoccola, DSupuran, CT Carbonic anhydrase inhibitors. Inhibition studies with anions and sulfonamides of a new cytosolic enzyme from the scleractinian coral Stylophora pistillata. Bioorg Med Chem Lett21:710-4 (2011) 
 
Carbonic anhydrase
Name:Carbonic anhydrase
Synonyms:Alpha carbonic anhydrase
Type:PROTEIN
Mol. Mass.:36650.57
Organism:Stylophora pistillata
Description:ChEMBL_700658
Residue:323
BDBM29277
NameBDBM29277
TypeSmall organic molecule
Emp. Form.C9H11NO4S
Mol. Mass.229.253
SMILESNS(=O)(=O)c1ccc(CCC(O)=O)cc1