Reaction Details
TargetCarbonic anhydrase
LigandBDBM10865
Substrate/Competitorn/a
Meas. Tech.ChEMBL_700658 (CHEMBL1645697)
Ki 88.3±n/a nM
Citation Bertucci, AInnocenti, AScozzafava, ATambutté, SZoccola, DSupuran, CT Carbonic anhydrase inhibitors. Inhibition studies with anions and sulfonamides of a new cytosolic enzyme from the scleractinian coral Stylophora pistillata. Bioorg Med Chem Lett21:710-4 (2011) 
 
Carbonic anhydrase
Name:Carbonic anhydrase
Synonyms:Alpha carbonic anhydrase
Type:PROTEIN
Mol. Mass.:36650.57
Organism:Stylophora pistillata
Description:ChEMBL_700658
Residue:323
BDBM10865
NameBDBM10865
TypeSmall organic molecule
Emp. Form.C6H7IN2O2S
Mol. Mass.298.101
SMILESNc1ccc(cc1I)S(N)(=O)=O