Reaction Details
TargetCarbonic anhydrase
LigandBDBM11639
Substrate/Competitorn/a
Meas. Tech.ChEMBL_700658 (CHEMBL1645697)
Ki 34.2±n/a nM
Citation Bertucci, AInnocenti, AScozzafava, ATambutté, SZoccola, DSupuran, CT Carbonic anhydrase inhibitors. Inhibition studies with anions and sulfonamides of a new cytosolic enzyme from the scleractinian coral Stylophora pistillata. Bioorg Med Chem Lett21:710-4 (2011) 
 
Carbonic anhydrase
Name:Carbonic anhydrase
Synonyms:Alpha carbonic anhydrase
Type:PROTEIN
Mol. Mass.:36650.57
Organism:Stylophora pistillata
Description:ChEMBL_700658
Residue:323
BDBM11639
NameBDBM11639
TypeSmall organic molecule
Emp. Form.C17H14F3N3O2S
Mol. Mass.381.372
SMILESCc1ccc(cc1)-c1cc(nn1-c1ccc(cc1)S(N)(=O)=O)C(F)(F)F