Reaction Details
TargetCarbonic anhydrase 1
LigandBDBM10872
Substrate/Competitorn/a
Meas. Tech.ChEMBL_700655 (CHEMBL1645694)
Ki 185±n/a nM
Citation Bertucci, AInnocenti, AScozzafava, ATambutté, SZoccola, DSupuran, CT Carbonic anhydrase inhibitors. Inhibition studies with anions and sulfonamides of a new cytosolic enzyme from the scleractinian coral Stylophora pistillata. Bioorg Med Chem Lett21:710-4 (2011) 
 
Carbonic anhydrase 1
Name:Carbonic anhydrase 1
Type:Enzyme
Mol. Mass.:28873.37
Organism:Homo sapiens (Human)
Description:P00915
Residue:261
BDBM10872
NameBDBM10872
Synonyms:4-amino-N-[2-(4-sulfamoylphenyl)ethyl]benzene-1-sulfonamide aromatic/heteroaromatic sulfonamide 17
TypeSmall organic molecule
Emp. Form.C14H17N3O4S2
Mol. Mass.355.432
SMILESNc1ccc(cc1)S(=O)(=O)NCCc1ccc(cc1)S(N)(=O)=O