Reaction Details
TargetProstaglandin E2 receptor EP4 subtype
LigandBDBM50333725
Substrate/Competitorn/a
Meas. Tech.ChEMBL_700673 (CHEMBL1645712)
Ki 5.5±n/a nM
Citation Li, LMathieu, MCDenis, DTherien, AGWang, Z The identification of substituted benzothiophene derivatives as PGE(2) subtype 4 receptor antagonists: From acid to non-acid. Bioorg Med Chem Lett21:734-7 (2011) 
 
Prostaglandin E2 receptor EP4 subtype
Name:Prostaglandin E2 receptor EP4 subtype
Type:Enzyme
Mol. Mass.:53134.53
Organism:Homo sapiens (Human)
Description:P35408
Residue:488
BDBM50333725
NameBDBM50333725
Synonyms:3-(4-(2-(3-(4-chlorophenylsulfonyl)ureido)ethyl)phenyl)-N,N,5,7-tetramethylbenzo[b]thiophene-2-carboxamide | CHEMBL1644004
TypeSmall organic molecule
Emp. Form.C28H28ClN3O4S2
Mol. Mass.570.123
SMILESCN(C)C(=O)c1sc2c(C)cc(C)cc2c1-c1ccc(CCNC(=O)NS(=O)(=O)c2ccc(Cl)cc2)cc1