Reaction Details
TargetCarboxylic ester hydrolase
LigandBDBM8961
Substrate/Competitorn/a
Meas. Tech.ChEMBL_700711 (CHEMBL1645750)
IC50 27.08±n/a nM
Citation Luo, WLi, YPHe, YHuang, SLTan, JHOu, TMLi, DGu, LQHuang, ZS Design, synthesis and evaluation of novel tacrine-multialkoxybenzene hybrids as dual inhibitors for cholinesterases and amyloid beta aggregation. Bioorg Med Chem19:763-70 (2011) 
 
Carboxylic ester hydrolase
Name:Carboxylic ester hydrolase
Type:Protein
Mol. Mass.:68842.83
Organism:Equus caballus (Horse)
Description:Q9N1N9
Residue:602
BDBM8961
NameBDBM8961
Synonyms:1,2,3,4-tetrahydro-9-acridinamine 9-THA CHEMBL1337960 Cognex Tracine cid_1935 | tacrine.HCl
TypeSmall organic molecule
Emp. Form.C13H14N2
Mol. Mass.198.2637
SMILESNc1c2CCCCc2nc2ccccc12