Reaction Details
TargetPhospholipase A2 group V
LigandBDBM50333788
Substrate/Competitorn/a
Meas. Tech.ChEMBL_700980 (CHEMBL1648640)
IC50 2600±n/a nM
Citation Mouchlis, VDMagrioti, VBarbayianni, ECermak, NOslund, RCMavromoustakos, TMGelb, MHKokotos, G Inhibition of secreted phospholipases A2 by 2-oxoamides based ona-amino acids: Synthesis, in vitro evaluation and molecular docking calculations. Bioorg Med Chem19:735-43 (2011) 
 
Phospholipase A2 group V
Name:Phospholipase A2 group V
Type:PROTEIN
Mol. Mass.:15864.30
Organism:Mus musculus
Description:ChEMBL_700980
Residue:137
BDBM50333788
NameBDBM50333788
Synonyms:(S)-4-Methyl-2-(2-oxohexadecanamido)pentanoic acid | CHEMBL1644549
TypeSmall organic molecule
Emp. Form.C22H41NO4
Mol. Mass.383.5652
(=O)C(=O)N[C@@H](CC(C)C)C(O)=O