Reaction Details
TargetProstaglandin D2 receptor 2
LigandBDBM50161746
Substrate/Competitorn/a
Meas. Tech.ChEMBL_699801 (CHEMBL1645647)
Ki 5.5±n/a nM
Citation Gallant, MBeaulieu, CBerthelette, CColucci, JCrackower, MADalton, CDenis, DDucharme, YFriesen, RWGuay, DGervais, FGHamel, MHoule, RKrawczyk, CMKosjek, BLau, SLeblanc, YLee, EELevesque, JFMellon, CMolinaro, CMullet, WO'Neill, GPO'Shea, PSawyer, NSillaots, SSimard, DSlipetz, DStocco, RSørensen, DTruong, VLWong, EWu, JZaghdane, HWang, Z Discovery of MK-7246, a selective CRTH2 antagonist for the treatment of respiratory diseases. Bioorg Med Chem Lett21:288-93 (2010) 
 
Prostaglandin D2 receptor 2
Name:Prostaglandin D2 receptor 2
Type:Enzyme
Mol. Mass.:43295.45
Organism:Homo sapiens (Human)
Description:Q9Y5Y4
Residue:395
BDBM50161746
NameBDBM50161746
Synonyms:(R)-3-(3-(4-fluorophenylsulfonamido)-1,2,3,4-tetrahydrocarbazol-9-yl)propanoic acid CHEMBL361812 | RAMATROBAN
TypeSmall organic molecule
Emp. Form.C21H21FN2O4S
Mol. Mass.416.466
SMILESOC(=O)CCn1c2CC[C@H](Cc2c2ccccc12)NS(=O)(=O)c1ccc(F)cc1