Reaction Details
TargetProstaglandin D2 receptor 2
LigandBDBM50333860
Substrate/Competitorn/a
Meas. Tech.ChEMBL_699801 (CHEMBL1645647)
Ki 20±n/a nM
Citation Gallant, MBeaulieu, CBerthelette, CColucci, JCrackower, MADalton, CDenis, DDucharme, YFriesen, RWGuay, DGervais, FGHamel, MHoule, RKrawczyk, CMKosjek, BLau, SLeblanc, YLee, EELevesque, JFMellon, CMolinaro, CMullet, WO'Neill, GPO'Shea, PSawyer, NSillaots, SSimard, DSlipetz, DStocco, RSørensen, DTruong, VLWong, EWu, JZaghdane, HWang, Z Discovery of MK-7246, a selective CRTH2 antagonist for the treatment of respiratory diseases. Bioorg Med Chem Lett21:288-93 (2010) 
 
Prostaglandin D2 receptor 2
Name:Prostaglandin D2 receptor 2
Type:Enzyme
Mol. Mass.:43295.45
Organism:Homo sapiens (Human)
Description:Q9Y5Y4
Residue:395
BDBM50333860
NameBDBM50333860
Synonyms:(R)-2-(7-(1-(4-fluorophenyl)-N-methylmethylsulfonamido)-6,7,8,9-tetrahydropyrido[1,2-a]indol-10-yl)acetic acid | CHEMBL1643800
TypeSmall organic molecule
Emp. Form.C22H23FN2O4S
Mol. Mass.430.492
SMILESCN([C@@H]1CCc2c(CC(O)=O)c3ccccc3n2C1)S(=O)(=O)Cc1ccc(F)cc1