Reaction Details
TargetProstaglandin D2 receptor 2
LigandBDBM50333870
Substrate/Competitorn/a
Meas. Tech.ChEMBL_699805 (CHEMBL1645651)
IC50 3.6±n/a nM
Citation Gallant, MBeaulieu, CBerthelette, CColucci, JCrackower, MADalton, CDenis, DDucharme, YFriesen, RWGuay, DGervais, FGHamel, MHoule, RKrawczyk, CMKosjek, BLau, SLeblanc, YLee, EELevesque, JFMellon, CMolinaro, CMullet, WO'Neill, GPO'Shea, PSawyer, NSillaots, SSimard, DSlipetz, DStocco, RSørensen, DTruong, VLWong, EWu, JZaghdane, HWang, Z Discovery of MK-7246, a selective CRTH2 antagonist for the treatment of respiratory diseases. Bioorg Med Chem Lett21:288-93 (2010) 
 
Prostaglandin D2 receptor 2
Name:Prostaglandin D2 receptor 2
Type:Enzyme
Mol. Mass.:43295.45
Organism:Homo sapiens (Human)
Description:Q9Y5Y4
Residue:395
BDBM50333870
NameBDBM50333870
Synonyms:(R)-2-(7-(4-fluoro-N-methylphenylsulfonamido)-3-(trifluoromethyl)-6,7,8,9-tetrahydropyrido[1,2-a]indol-10-yl)acetic acid | CHEMBL1643775
TypeSmall organic molecule
Emp. Form.C22H20F4N2O4S
Mol. Mass.484.464
SMILESCN([C@@H]1CCc2c(CC(O)=O)c3ccc(cc3n2C1)C(F)(F)F)S(=O)(=O)c1ccc(F)cc1