Reaction Details
TargetCytochrome P450 3A4
LigandBDBM50333841
Substrate/Competitorn/a
Meas. Tech.ChEMBL_699809 (CHEMBL1645655)
IC50>50000±n/a nM
Citation Gallant, MBeaulieu, CBerthelette, CColucci, JCrackower, MADalton, CDenis, DDucharme, YFriesen, RWGuay, DGervais, FGHamel, MHoule, RKrawczyk, CMKosjek, BLau, SLeblanc, YLee, EELevesque, JFMellon, CMolinaro, CMullet, WO'Neill, GPO'Shea, PSawyer, NSillaots, SSimard, DSlipetz, DStocco, RSørensen, DTruong, VLWong, EWu, JZaghdane, HWang, Z Discovery of MK-7246, a selective CRTH2 antagonist for the treatment of respiratory diseases. Bioorg Med Chem Lett21:288-93 (2010) 
 
Cytochrome P450 3A4
Name:Cytochrome P450 3A4
Type:Enzyme
Mol. Mass.:57349.57
Organism:Homo sapiens (Human)
Description:n/a
Residue:503
BDBM50333841
NameBDBM50333841
Synonyms:(R)-2-(3,4-difluoro-7-(4-fluoro-N-methylphenylsulfonamido)-6,7,8,9-tetrahydropyrido[1,2-a]indol-10-yl)acetic acid | CHEMBL1643780
TypeSmall organic molecule
Emp. Form.C21H19F3N2O4S
Mol. Mass.452.447
SMILESCN([C@@H]1CCc2c(CC(O)=O)c3ccc(F)c(F)c3n2C1)S(=O)(=O)c1ccc(F)cc1