Reaction Details
TargetThioredoxin reductase 1, cytoplasmic
LigandBDBM50269016
Substrate/Competitorn/a
Meas. Tech.ChEMBL_700048 (CHEMBL1646825)
IC50>200000±n/a nM
Citation Sorrentino, FKarioti, AGratteri, PRigobello, MPScutari, GMessori, LBindoli, AChioccioli, MGabbiani, CBergonzi, MCBilia, AR Hypericins and thioredoxin reductase: Biochemical and docking studies disclose the molecular basis for effective inhibition by naphthodianthrones. Bioorg Med Chem19:631-41 (2011) 
 
Thioredoxin reductase 1, cytoplasmic
Name:Thioredoxin reductase 1, cytoplasmic
Type:PROTEIN
Mol. Mass.:54519.34
Organism:Rattus norvegicus
Description:ChEMBL_589950
Residue:498
BDBM50269016
NameBDBM50269016
Synonyms:CHEMBL497001 | aloin
TypeSmall organic molecule
Emp. Form.C21H22O9
Mol. Mass.418.394
SMILESOC[C@H]1O[C@H]([C@H](O)[C@@H](O)[C@@H]1O)C1c2cccc(O)c2C(=O)c2c(O)cc(CO)cc12