Reaction Details
TargetIntegrin alpha-L/beta-2
LigandBDBM50333899
Substrate/Competitorn/a
Meas. Tech.ChEMBL_700233 (CHEMBL1647334)
IC50 810±n/a nM
Citation Zhong, MHanan, EJShen, WBui, MArkin, MRBarr, KJEvanchik, MJHoch, UHyde, JMartell, JROslob, JDPaulvannan, KPrabhu, SSilverman, JAWright, JYu, CHZhu, JFlanagan, WM Structure-activity relationship (SAR) of thea-amino acid residue of potent tetrahydroisoquinoline (THIQ)-derived LFA-1/ICAM-1 antagonists. Bioorg Med Chem Lett21:307-10 (2010) 
 
Integrin alpha-L/beta-2
Name:Integrin alpha-L/beta-2
Type:n/a
Mol. Mass.:n/a
Description:ASSAY_ID of EBI is 32646
Components:This complex has 2 components.
Component 1
Name:Integrin alpha-L
Synonyms:CD11 antigen-like family member A CD_antigen=CD11a ITGAL LFA-1A Leukocyte adhesion glycoprotein LFA-1 alpha chain | Leukocyte function-associated molecule 1 alpha chain
Type:PROTEIN
Mol. Mass.:128748.90
Organism:Homo sapiens (Human)
Description:ChEMBL_629045
Residue:1170
Component 2
Name:Integrin beta-2
Synonyms:CD18 ITGB2 MFI7
Type:PROTEIN
Mol. Mass.:84785.60
Organism:Homo sapiens (Human)
Description:EBI_12662
Residue:769
BDBM50333899
NameBDBM50333899
Synonyms:(S)-2-(5,7-dichloro-2-(4-chlorobenzoyl)-1,2,3,4-tetrahydroisoquinoline-6-carboxamido)-3-(1H-indole-3-carboxamido)propanoic acid | CHEMBL1644113
TypeSmall organic molecule
Emp. Form.C29H23Cl3N4O5
Mol. Mass.613.876
SMILESOC(=O)[C@H](CNC(=O)c1c[nH]c2ccccc12)NC(=O)c1c(Cl)cc2CN(CCc2c1Cl)C(=O)c1ccc(Cl)cc1