Reaction Details
TargetIntegrin alpha-L/beta-2
LigandBDBM50333915
Substrate/Competitorn/a
Meas. Tech.ChEMBL_700234 (CHEMBL1647335)
IC50 190±n/a nM
Citation Zhong, MHanan, EJShen, WBui, MArkin, MRBarr, KJEvanchik, MJHoch, UHyde, JMartell, JROslob, JDPaulvannan, KPrabhu, SSilverman, JAWright, JYu, CHZhu, JFlanagan, WM Structure-activity relationship (SAR) of thea-amino acid residue of potent tetrahydroisoquinoline (THIQ)-derived LFA-1/ICAM-1 antagonists. Bioorg Med Chem Lett21:307-10 (2010) 
 
Integrin alpha-L/beta-2
Name:Integrin alpha-L/beta-2
Type:n/a
Mol. Mass.:n/a
Description:ASSAY_ID of EBI is 32646
Components:This complex has 2 components.
Component 1
Name:Integrin alpha-L
Synonyms:CD11 antigen-like family member A CD_antigen=CD11a ITGAL LFA-1A Leukocyte adhesion glycoprotein LFA-1 alpha chain | Leukocyte function-associated molecule 1 alpha chain
Type:PROTEIN
Mol. Mass.:128748.90
Organism:Homo sapiens (Human)
Description:ChEMBL_629045
Residue:1170
Component 2
Name:Integrin beta-2
Synonyms:CD18 ITGB2 MFI7
Type:PROTEIN
Mol. Mass.:84785.60
Organism:Homo sapiens (Human)
Description:EBI_12662
Residue:769
BDBM50333915
NameBDBM50333915
Synonyms:(S)-2-(2-(benzofuran-2-carbonyl)-5,7-dichloro-1,2,3,4-tetrahydroisoquinoline-6-carboxamido)-3-(1-isopropyl-1H-1,2,3-triazol-4-yl)propanoic acid | CHEMBL1644129
TypeSmall organic molecule
Emp. Form.C27H25Cl2N5O5
Mol. Mass.570.424
SMILESCC(C)n1cc(C[C@H](NC(=O)c2c(Cl)cc3CN(CCc3c2Cl)C(=O)c2cc3ccccc3o2)C(O)=O)nn1