Reaction Details
TargetIntegrin alpha-L/beta-2
LigandBDBM50125195
Substrate/Competitorn/a
Meas. Tech.ChEMBL_700235 (CHEMBL1647336)
IC50 750±n/a nM
Citation Zhong, MHanan, EJShen, WBui, MArkin, MRBarr, KJEvanchik, MJHoch, UHyde, JMartell, JROslob, JDPaulvannan, KPrabhu, SSilverman, JAWright, JYu, CHZhu, JFlanagan, WM Structure-activity relationship (SAR) of thea-amino acid residue of potent tetrahydroisoquinoline (THIQ)-derived LFA-1/ICAM-1 antagonists. Bioorg Med Chem Lett21:307-10 (2010) 
 
Integrin alpha-L/beta-2
Name:Integrin alpha-L/beta-2
Type:n/a
Mol. Mass.:n/a
Description:ASSAY_ID of EBI is 32646
Components:This complex has 2 components.
Component 1
Name:Integrin alpha-L
Synonyms:CD11 antigen-like family member A CD_antigen=CD11a ITGAL LFA-1A Leukocyte adhesion glycoprotein LFA-1 alpha chain | Leukocyte function-associated molecule 1 alpha chain
Type:PROTEIN
Mol. Mass.:128748.90
Organism:Homo sapiens (Human)
Description:ChEMBL_629045
Residue:1170
Component 2
Name:Integrin beta-2
Synonyms:CD18 ITGB2 MFI7
Type:PROTEIN
Mol. Mass.:84785.60
Organism:Homo sapiens (Human)
Description:EBI_12662
Residue:769
BDBM50125195
NameBDBM50125195
Synonyms:(S)-2-(2-Bromo-benzoylamino)-3-(3H-imidazol-4-yl)-propionic acid | CHEMBL7140
TypeSmall organic molecule
Emp. Form.C13H12BrN3O3
Mol. Mass.338.157
SMILESOC(=O)[C@H](Cc1cnc[nH]1)NC(=O)c1ccccc1Br