Reaction Details
TargetRenin
LigandBDBM50333948
Substrate/Competitorn/a
Meas. Tech.ChEMBL_700283 (CHEMBL1647501)
Ki 130±n/a nM
Citation Sund, CBelda, OWiktelius, DSahlberg, CVrang, LSedig, SHamelink, EHenderson, IAgback, TJansson, KBorkakoti, NDerbyshire, DEneroth, ASamuelsson, B Design and synthesis of potent macrocyclic renin inhibitors. Bioorg Med Chem Lett21:358-62 (2010) 
 
Renin
Name:Renin
Type:Enzyme
Mol. Mass.:45058.99
Organism:Homo sapiens (Human)
Description:n/a
Residue:406
BDBM50333948
NameBDBM50333948
Synonyms:(S)-2-{(S)-2-Hydroxy-2-[(S)-18-(methanesulfonyl-methyl-amino)-4-(4-methoxy-phenyl)-2,15-dioxo-11-oxa-3,14-diaza-tricyclo[14.3.1.1*5,9*]henicosa-1(20),5,7,9(21),16,18-hexaen-13-yl]-ethyl}-N-isobutyl-3-methyl-butyramideyramide | CHEMBL1644466
TypeSmall organic molecule
Emp. Form.C38H50N4O8S
Mol. Mass.722.891
SMILESCOc1ccc(cc1)C1NC(=O)c2cc(cc(c2)C(=O)N[C@@H](COCc2cccc1c2)[C@@H](O)C[C@@H](C(C)C)C(=O)NCC(C)C)N(C)S(C)(=O)=O