Reaction Details
TargetRenin
LigandBDBM50333951
Substrate/Competitorn/a
Meas. Tech.ChEMBL_700283 (CHEMBL1647501)
Ki 940±n/a nM
Citation Sund, CBelda, OWiktelius, DSahlberg, CVrang, LSedig, SHamelink, EHenderson, IAgback, TJansson, KBorkakoti, NDerbyshire, DEneroth, ASamuelsson, B Design and synthesis of potent macrocyclic renin inhibitors. Bioorg Med Chem Lett21:358-62 (2010) 
 
Renin
Name:Renin
Type:Enzyme
Mol. Mass.:45058.99
Organism:Homo sapiens (Human)
Description:n/a
Residue:406
BDBM50333951
NameBDBM50333951
Synonyms:(S)-2-{(S)-2-Hydroxy-2-[(S)-19-(methanesulfonyl-methyl-amino)-5-(2-methoxy-ethoxy)-16-oxo-12-oxa-15-aza-tricyclo[15.3.1.1*6,10*]docosa-1(21),6,8,10(22),17,19-hexaen-14-yl]-ethyl}-N-isobutyl-3-methyl-butyramide | CHEMBL1644469
TypeSmall organic molecule
Emp. Form.C36H55N3O8S
Mol. Mass.689.902
SMILESCOCCOC1CCCc2cc(cc(c2)C(=O)N[C@@H](COCc2cccc1c2)[C@@H](O)C[C@@H](C(C)C)C(=O)NCC(C)C)N(C)S(C)(=O)=O