Reaction Details
TargetCathepsin D
LigandBDBM50333943
Substrate/Competitorn/a
Meas. Tech.ChEMBL_700285 (CHEMBL1647503)
Ki 3.3±n/a nM
Citation Sund, CBelda, OWiktelius, DSahlberg, CVrang, LSedig, SHamelink, EHenderson, IAgback, TJansson, KBorkakoti, NDerbyshire, DEneroth, ASamuelsson, B Design and synthesis of potent macrocyclic renin inhibitors. Bioorg Med Chem Lett21:358-62 (2010) 
 
Cathepsin D
Name:Cathepsin D
Type:Enzyme
Mol. Mass.:44551.72
Organism:Homo sapiens (Human)
Description:Human proCathepsin D (SwissProt accession number P07339) was expressed in Sf9 cells, purified, and autoactivated.
Residue:412
BDBM50333943
NameBDBM50333943
Synonyms:CHEMBL1644461 | N1-((2S,3S,5S)-5-((S)-1-(benzylamino)-3-methyl-1-oxobutan-2-ylcarbamoyl)-1-(benzyloxy)-3-hydroxy-6-methylheptan-2-yl)-5-(N-methylmethylsulfonamido)-N3-((R)-1-phenylethyl)isophthalamide
TypeSmall organic molecule
Emp. Form.C46H59N5O8S
Mol. Mass.842.054
SMILESCC(C)[C@H](C[C@H](O)[C@H](COCc1ccccc1)NC(=O)c1cc(cc(c1)C(=O)N[C@H](C)c1ccccc1)N(C)S(C)(=O)=O)C(=O)N[C@@H](C(C)C)C(=O)NCc1ccccc1