Reaction Details
TargetSodium-dependent serotonin transporter
LigandBDBM50333952
Substrate/Competitorn/a
Meas. Tech.ChEMBL_700295 (CHEMBL1647513)
IC50 7644±n/a nM
Citation Angus, DBingham, MBuchanan, DDunbar, NGibson, LGoodwin, RHaunsø, AHoughton, AHuggett, MMorphy, RNapier, SNimz, OPassmore, JWalker, G The identification, and optimisation of hERG selectivity, of a mixed NET/SERT re-uptake inhibitor for the treatment of pain. Bioorg Med Chem Lett21:271-5 (2010) 
 
Sodium-dependent serotonin transporter
Name:Sodium-dependent serotonin transporter
Type:Multi-pass membrane protein
Mol. Mass.:70322.51
Organism:Homo sapiens (Human)
Description:P31645
Residue:630
BDBM50333952
NameBDBM50333952
Synonyms:CHEMBL1644470 | exo-(1R,5S)-3-(6-phenylpyridin-2-yloxy)-8-azabicyclo[3.2.1]octane
TypeSmall organic molecule
Emp. Form.C18H20N2O
Mol. Mass.280.3642
SMILESC1C[C@@H]2C[C@H](C[C@H]1N2)Oc1cccc(n1)-c1ccccc1