Reaction Details
TargetMitogen-activated protein kinase 10
LigandBDBM50334005
Substrate/Competitorn/a
Meas. Tech.ChEMBL_700502 (CHEMBL1648161)
IC50 590±n/a nM
Citation Probst, GDBowers, SSealy, JMTruong, APHom, RKGalemmo, RAKonradi, AWSham, HLQuincy, DAPan, HYao, NLin, MTóth, GArtis, DRZmolek, WWong, KQin, ALorentzen, CNakamura, DFQuinn, KPSauer, JMPowell, KRuslim, LWright, SChereau, DRen, ZAnderson, JPBard, FYednock, TAGriswold-Prenner, I Highly selective c-Jun N-terminal kinase (JNK) 2 and 3 inhibitors with in vitro CNS-like pharmacokinetic properties prevent neurodegeneration. Bioorg Med Chem Lett21:315-9 (2010) 
 
Mitogen-activated protein kinase 10
Name:Mitogen-activated protein kinase 10
Type:Enzyme
Mol. Mass.:52586.89
Organism:Homo sapiens (Human)
Description:n/a
Residue:464
BDBM50334005
NameBDBM50334005
Synonyms:CHEMBL1644631 | N-(4-(4-(naphthalen-2-yl)-5-oxo-4,5-dihydro-1H-1,2,4-triazol-3-yl)pyridin-2-yl)benzamide
TypeSmall organic molecule
Emp. Form.C24H17N5O2
Mol. Mass.407.4241
SMILESO=C(Nc1cc(ccn1)-c1n[nH]c(=O)n1-c1ccc2ccccc2c1)c1ccccc1