Reaction Details
TargetMitogen-activated protein kinase 9
LigandBDBM50334002
Substrate/Competitorn/a
Meas. Tech.ChEMBL_701206 (CHEMBL1648826)
IC50 780±n/a nM
Citation Probst, GDBowers, SSealy, JMTruong, APHom, RKGalemmo, RAKonradi, AWSham, HLQuincy, DAPan, HYao, NLin, MTóth, GArtis, DRZmolek, WWong, KQin, ALorentzen, CNakamura, DFQuinn, KPSauer, JMPowell, KRuslim, LWright, SChereau, DRen, ZAnderson, JPBard, FYednock, TAGriswold-Prenner, I Highly selective c-Jun N-terminal kinase (JNK) 2 and 3 inhibitors with in vitro CNS-like pharmacokinetic properties prevent neurodegeneration. Bioorg Med Chem Lett21:315-9 (2010) 
 
Mitogen-activated protein kinase 9
Name:Mitogen-activated protein kinase 9
Type:Enzyme
Mol. Mass.:48131.49
Organism:Homo sapiens (Human)
Description:JNK-2 was purchased from Upstate Cell Signaling Solutions (formerly Upstate Biotechnology).
Residue:424
BDBM50334002
NameBDBM50334002
Synonyms:4-(6-bromonaphthalen-2-yl)-3-(2-(tetrahydro-2H-pyran-4-ylamino)pyridin-4-yl)-1H-1,2,4-triazol-5(4H)-one | CHEMBL1644634
TypeSmall organic molecule
Emp. Form.C22H20BrN5O2
Mol. Mass.466.331
SMILESBrc1ccc2cc(ccc2c1)-n1c(n[nH]c1=O)-c1ccnc(NC2CCOCC2)c1