Reaction Details
TargetMitogen-activated protein kinase 14
LigandBDBM50333997
Substrate/Competitorn/a
Meas. Tech.ChEMBL_701209 (CHEMBL1648829)
IC50>50000±n/a nM
Citation Probst, GDBowers, SSealy, JMTruong, APHom, RKGalemmo, RAKonradi, AWSham, HLQuincy, DAPan, HYao, NLin, MTóth, GArtis, DRZmolek, WWong, KQin, ALorentzen, CNakamura, DFQuinn, KPSauer, JMPowell, KRuslim, LWright, SChereau, DRen, ZAnderson, JPBard, FYednock, TAGriswold-Prenner, I Highly selective c-Jun N-terminal kinase (JNK) 2 and 3 inhibitors with in vitro CNS-like pharmacokinetic properties prevent neurodegeneration. Bioorg Med Chem Lett21:315-9 (2010) 
 
Mitogen-activated protein kinase 14
Name:Mitogen-activated protein kinase 14
Type:Serine/threonine-protein kinase
Mol. Mass.:41286.76
Organism:Homo sapiens (Human)
Description:Q16539
Residue:360
BDBM50333997
NameBDBM50333997
Synonyms:CHEMBL1644646 | methyl 4-(4-(naphthalen-2-yl)-5-oxo-3-(2-(tetrahydro-2H-pyran-4-ylamino)pyridin-4-yl)-4,5-dihydro-1H-1,2,4-triazol-1-yl)piperidine-1-carboxylate
TypeSmall organic molecule
Emp. Form.C29H32N6O4
Mol. Mass.528.6022
SMILESCOC(=O)N1CCC(CC1)n1nc(-c2ccnc(NC3CCOCC3)c2)n(-c2ccc3ccccc3c2)c1=O