Reaction Details
TargetMitogen-activated protein kinase 8
LigandBDBM50333984
Substrate/Competitorn/a
Meas. Tech.ChEMBL_701207 (CHEMBL1648827)
IC50 4600±n/a nM
Citation Probst, GDBowers, SSealy, JMTruong, APHom, RKGalemmo, RAKonradi, AWSham, HLQuincy, DAPan, HYao, NLin, MTóth, GArtis, DRZmolek, WWong, KQin, ALorentzen, CNakamura, DFQuinn, KPSauer, JMPowell, KRuslim, LWright, SChereau, DRen, ZAnderson, JPBard, FYednock, TAGriswold-Prenner, I Highly selective c-Jun N-terminal kinase (JNK) 2 and 3 inhibitors with in vitro CNS-like pharmacokinetic properties prevent neurodegeneration. Bioorg Med Chem Lett21:315-9 (2010) 
 
Mitogen-activated protein kinase 8
Name:Mitogen-activated protein kinase 8
Type:Enzyme
Mol. Mass.:48297.57
Organism:Homo sapiens (Human)
Description:JNK-1 was purchased from Upstate Cell Signaling Solutions (formerly Upstate Biotechnology).
Residue:427
BDBM50333984
NameBDBM50333984
Synonyms:CHEMBL1644630 | N-(4-(4-(naphthalen-2-yl)-5-oxo-4,5-dihydro-1H-1,2,4-triazol-3-yl)pyridin-2-yl)cyclopropanecarboxamide
TypeSmall organic molecule
Emp. Form.C21H17N5O2
Mol. Mass.371.392
SMILESO=C(Nc1cc(ccn1)-c1n[nH]c(=O)n1-c1ccc2ccccc2c1)C1CC1