Reaction Details
TargetMitogen-activated protein kinase 8
LigandBDBM50333985
Substrate/Competitorn/a
Meas. Tech.ChEMBL_701207 (CHEMBL1648827)
IC50>50000±n/a nM
Citation Probst, GDBowers, SSealy, JMTruong, APHom, RKGalemmo, RAKonradi, AWSham, HLQuincy, DAPan, HYao, NLin, MTóth, GArtis, DRZmolek, WWong, KQin, ALorentzen, CNakamura, DFQuinn, KPSauer, JMPowell, KRuslim, LWright, SChereau, DRen, ZAnderson, JPBard, FYednock, TAGriswold-Prenner, I Highly selective c-Jun N-terminal kinase (JNK) 2 and 3 inhibitors with in vitro CNS-like pharmacokinetic properties prevent neurodegeneration. Bioorg Med Chem Lett21:315-9 (2010) 
 
Mitogen-activated protein kinase 8
Name:Mitogen-activated protein kinase 8
Type:Enzyme
Mol. Mass.:48297.57
Organism:Homo sapiens (Human)
Description:JNK-1 was purchased from Upstate Cell Signaling Solutions (formerly Upstate Biotechnology).
Residue:427
BDBM50333985
NameBDBM50333985
Synonyms:3-(2-(cyclopentylamino)pyridin-4-yl)-4-(naphthalen-2-yl)-1H-1,2,4-triazol-5(4H)-one | CHEMBL1644621
TypeSmall organic molecule
Emp. Form.C22H21N5O
Mol. Mass.371.435
SMILESO=c1[nH]nc(-c2ccnc(NC3CCCC3)c2)n1-c1ccc2ccccc2c1