Reaction Details
TargetMitogen-activated protein kinase 14
LigandBDBM50333987
Substrate/Competitorn/a
Meas. Tech.ChEMBL_701209 (CHEMBL1648829)
IC50>50000±n/a nM
Citation Probst, GDBowers, SSealy, JMTruong, APHom, RKGalemmo, RAKonradi, AWSham, HLQuincy, DAPan, HYao, NLin, MTóth, GArtis, DRZmolek, WWong, KQin, ALorentzen, CNakamura, DFQuinn, KPSauer, JMPowell, KRuslim, LWright, SChereau, DRen, ZAnderson, JPBard, FYednock, TAGriswold-Prenner, I Highly selective c-Jun N-terminal kinase (JNK) 2 and 3 inhibitors with in vitro CNS-like pharmacokinetic properties prevent neurodegeneration. Bioorg Med Chem Lett21:315-9 (2010) 
 
Mitogen-activated protein kinase 14
Name:Mitogen-activated protein kinase 14
Type:Serine/threonine-protein kinase
Mol. Mass.:41286.76
Organism:Homo sapiens (Human)
Description:Q16539
Residue:360
BDBM50333987
NameBDBM50333987
Synonyms:4-(naphthalen-2-yl)-3-(2-(tetrahydro-2H-pyran-3-ylamino)pyridin-4-yl)-1H-1,2,4-triazol-5(4H)-one | CHEMBL1644619
TypeSmall organic molecule
Emp. Form.C22H21N5O2
Mol. Mass.387.4344
SMILESO=c1[nH]nc(-c2ccnc(NC3CCCOC3)c2)n1-c1ccc2ccccc2c1