Reaction Details
TargetCannabinoid receptor 1
LigandBDBM50334013
Substrate/Competitorn/a
Meas. Tech.ChEMBL_701233 (CHEMBL1648853)
EC50>1000±n/a nM
Citation Yang, SWSmotryski, JMatasi, JHo, GTulshian, DGreenlee, WJBrusa, RBeltramo, MCox, K Structure-activity relationships of 2,4-diphenyl-1H-imidazole analogs as CB2 receptor agonists for the treatment of chronic pain. Bioorg Med Chem Lett21:182-5 (2010) 
 
Cannabinoid receptor 1
Name:Cannabinoid receptor 1
Type:G Protein-Coupled Receptor (GPCR)
Mol. Mass.:52868.96
Organism:Homo sapiens (Human)
Description:P21554
Residue:472
BDBM50334013
NameBDBM50334013
Synonyms:4-(3-(1-(cyclopropylmethyl)-4-(3-(trifluoromethyl)phenyl)-1H-imidazol-2-yl)benzyl)morpholine | CHEMBL1644669
TypeSmall organic molecule
Emp. Form.C25H26F3N3O
Mol. Mass.441.4886
SMILESFC(F)(F)c1cccc(c1)-c1cn(CC2CC2)c(n1)-c1cccc(CN2CCOCC2)c1