Reaction Details
TargetCannabinoid receptor 1
LigandBDBM50334020
Substrate/Competitorn/a
Meas. Tech.ChEMBL_701233 (CHEMBL1648853)
EC50 2290±n/a nM
Citation Yang, SWSmotryski, JMatasi, JHo, GTulshian, DGreenlee, WJBrusa, RBeltramo, MCox, K Structure-activity relationships of 2,4-diphenyl-1H-imidazole analogs as CB2 receptor agonists for the treatment of chronic pain. Bioorg Med Chem Lett21:182-5 (2010) 
 
Cannabinoid receptor 1
Name:Cannabinoid receptor 1
Type:G Protein-Coupled Receptor (GPCR)
Mol. Mass.:52868.96
Organism:Homo sapiens (Human)
Description:P21554
Residue:472
BDBM50334020
NameBDBM50334020
Synonyms:4-fluoro-1-(3-(4-(3-(trifluoromethyl)phenyl)-1H-imidazol-2-yl)benzyl)piperidine | CHEMBL1644682
TypeSmall organic molecule
Emp. Form.C22H21F4N3
Mol. Mass.403.4159
SMILESFC1CCN(Cc2cccc(c2)-c2nc(c[nH]2)-c2cccc(c2)C(F)(F)F)CC1