Reaction Details
TargetCannabinoid receptor 1
LigandBDBM50334031
Substrate/Competitorn/a
Meas. Tech.ChEMBL_701233 (CHEMBL1648853)
EC50 140±n/a nM
Citation Yang, SWSmotryski, JMatasi, JHo, GTulshian, DGreenlee, WJBrusa, RBeltramo, MCox, K Structure-activity relationships of 2,4-diphenyl-1H-imidazole analogs as CB2 receptor agonists for the treatment of chronic pain. Bioorg Med Chem Lett21:182-5 (2010) 
 
Cannabinoid receptor 1
Name:Cannabinoid receptor 1
Type:G Protein-Coupled Receptor (GPCR)
Mol. Mass.:52868.96
Organism:Homo sapiens (Human)
Description:P21554
Residue:472
BDBM50334031
NameBDBM50334031
Synonyms:4-(3-(4-(2-fluoro-5-methoxyphenyl)-1H-imidazol-2-yl)benzyl)morpholine | CHEMBL1644734
TypeSmall organic molecule
Emp. Form.C21H22FN3O2
Mol. Mass.367.4167
SMILESCOc1ccc(F)c(c1)-c1c[nH]c(n1)-c1cccc(CN2CCOCC2)c1