Reaction Details
TargetCannabinoid receptor 1
LigandBDBM50334032
Substrate/Competitorn/a
Meas. Tech.ChEMBL_701233 (CHEMBL1648853)
EC50 25±n/a nM
Citation Yang, SWSmotryski, JMatasi, JHo, GTulshian, DGreenlee, WJBrusa, RBeltramo, MCox, K Structure-activity relationships of 2,4-diphenyl-1H-imidazole analogs as CB2 receptor agonists for the treatment of chronic pain. Bioorg Med Chem Lett21:182-5 (2010) 
 
Cannabinoid receptor 1
Name:Cannabinoid receptor 1
Type:G Protein-Coupled Receptor (GPCR)
Mol. Mass.:52868.96
Organism:Homo sapiens (Human)
Description:P21554
Residue:472
BDBM50334032
NameBDBM50334032
Synonyms:4,4-difluoro-1-(3-(4-(2-fluoro-5-methoxyphenyl)-1H-imidazol-2-yl)benzyl)piperidine | CHEMBL1644735
TypeSmall organic molecule
Emp. Form.C22H22F3N3O
Mol. Mass.401.4248
SMILESCOc1ccc(F)c(c1)-c1c[nH]c(n1)-c1cccc(CN2CCC(F)(F)CC2)c1