Reaction Details
TargetCannabinoid receptor 2
LigandBDBM50334011
Substrate/Competitorn/a
Meas. Tech.ChEMBL_701235 (CHEMBL1648855)
EC50 8±n/a nM
Citation Yang, SWSmotryski, JMatasi, JHo, GTulshian, DGreenlee, WJBrusa, RBeltramo, MCox, K Structure-activity relationships of 2,4-diphenyl-1H-imidazole analogs as CB2 receptor agonists for the treatment of chronic pain. Bioorg Med Chem Lett21:182-5 (2010) 
 
Cannabinoid receptor 2
Name:Cannabinoid receptor 2
Type:G Protein-Coupled Receptor (GPCR)
Mol. Mass.:39690.94
Organism:Homo sapiens (Human)
Description:P34972
Residue:360
BDBM50334011
NameBDBM50334011
Synonyms:4-(3-(4-(3-(trifluoromethyl)phenyl)-1H-imidazol-2-yl)benzyl)morpholine | CHEMBL1644675
TypeSmall organic molecule
Emp. Form.C21H20F3N3O
Mol. Mass.387.3982
SMILESFC(F)(F)c1cccc(c1)-c1c[nH]c(n1)-c1cccc(CN2CCOCC2)c1