Reaction Details
TargetCannabinoid receptor 1
LigandBDBM50334044
Substrate/Competitorn/a
Meas. Tech.ChEMBL_701233 (CHEMBL1648853)
EC50 12550±n/a nM
Citation Yang, SWSmotryski, JMatasi, JHo, GTulshian, DGreenlee, WJBrusa, RBeltramo, MCox, K Structure-activity relationships of 2,4-diphenyl-1H-imidazole analogs as CB2 receptor agonists for the treatment of chronic pain. Bioorg Med Chem Lett21:182-5 (2010) 
 
Cannabinoid receptor 1
Name:Cannabinoid receptor 1
Type:G Protein-Coupled Receptor (GPCR)
Mol. Mass.:52868.96
Organism:Homo sapiens (Human)
Description:P21554
Residue:472
BDBM50334044
NameBDBM50334044
Synonyms:1-(3-(4-(2,3-dichlorophenyl)-1H-imidazol-2-yl)benzyl)piperidine | CHEMBL1644740
TypeSmall organic molecule
Emp. Form.C21H21Cl2N3
Mol. Mass.386.318
SMILESClc1cccc(-c2c[nH]c(n2)-c2cccc(CN3CCCCC3)c2)c1Cl