Reaction Details
TargetGlucocorticoid receptor
LigandBDBM50334051
Substrate/Competitorn/a
Meas. Tech.ChEMBL_701245 (CHEMBL1648865)
Ki 3.5±n/a nM
Citation Roach, SLHiguchi, RIHudson, ARAdams, MESyka, PMMais, DEMiner, JNMarschke, KBZhi, L Tetrahydroquinoline glucocorticoid receptor agonists: discovery of a 3-hydroxyl for improving receptor selectivity. Bioorg Med Chem Lett21:168-71 (2010) 
 
Glucocorticoid receptor
Name:Glucocorticoid receptor
Type:Enzyme
Mol. Mass.:85656.87
Organism:Homo sapiens (Human)
Description:P04150
Residue:777
BDBM50334051
NameBDBM50334051
Synonyms:4-allyl-5-chloro-6-(1H-indol-7-yl)-2,2,4,8-tetramethyl-1,2-dihydroquinolin-3(4H)-one | CHEMBL1644756
TypeSmall organic molecule
Emp. Form.C24H25ClN2O
Mol. Mass.392.921
SMILESCc1cc(c(Cl)c2c1NC(C)(C)C(=O)C2(C)CC=C)-c1cccc2cc[nH]c12