Reaction Details
TargetGlucocorticoid receptor
LigandBDBM50334054
Substrate/Competitorn/a
Meas. Tech.ChEMBL_701245 (CHEMBL1648865)
Ki 1.7±n/a nM
Citation Roach, SLHiguchi, RIHudson, ARAdams, MESyka, PMMais, DEMiner, JNMarschke, KBZhi, L Tetrahydroquinoline glucocorticoid receptor agonists: discovery of a 3-hydroxyl for improving receptor selectivity. Bioorg Med Chem Lett21:168-71 (2010) 
 
Glucocorticoid receptor
Name:Glucocorticoid receptor
Type:Enzyme
Mol. Mass.:85656.87
Organism:Homo sapiens (Human)
Description:P04150
Residue:777
BDBM50334054
NameBDBM50334054
Synonyms:(+/-)-(3R,4S)-5-chloro-6-(1H-indol-7-yl)-2,2,4,8-tetramethyl-1,2,3,4-tetrahydroquinolin-3-ol CHEMBL1644759
TypeSmall organic molecule
Emp. Form.C21H23ClN2O
Mol. Mass.354.873
SMILESC[C@@H]1[C@@H](O)C(C)(C)Nc2c(C)cc(c(Cl)c12)-c1cccc2cc[nH]c12