Reaction Details
TargetMetabotropic glutamate receptor 5
LigandBDBM50334108
Substrate/Competitorn/a
Meas. Tech.ChEMBL_698078 (CHEMBL1645998)
Ki 19±n/a nM
Citation Gilbert, AMBursavich, MGLombardi, SAdedoyin, ADwyer, JMHughes, ZKern, JCKhawaja, XRosenzweig-Lipson, SMoore, WJNeal, SJOlsen, MRizzo, SJSpringer, D 3-(Pyridin-2-yl-ethynyl)benzamide metabotropic glutamate receptor 5 negative allosteric modulators: hit to lead studies. Bioorg Med Chem Lett21:195-9 (2010) 
 
Metabotropic glutamate receptor 5
Name:Metabotropic glutamate receptor 5
Type:Enzyme
Mol. Mass.:131900.14
Organism:Rattus norvegicus (Rat)
Description:P31424
Residue:1203
BDBM50334108
NameBDBM50334108
Synonyms:(4-methoxy-3-(pyridin-2-ylethynyl)phenyl)(4-(5-methylpyridin-2-yl)piperazin-1-yl)methanone | CHEMBL1645023
TypeSmall organic molecule
Emp. Form.C25H24N4O2
Mol. Mass.412.4837
SMILESCOc1ccc(cc1C#Cc1ccccn1)C(=O)N1CCN(CC1)c1ccc(C)cn1