Reaction Details
TargetProstaglandin E2 receptor EP4 subtype
LigandBDBM50334139
Substrate/Competitorn/a
Meas. Tech.ChEMBL_698178 (CHEMBL1646483)
Ki 30±n/a nM
Citation Boyd, MJBerthelette, CChiasson, JFClark, PColucci, JDenis, DHan, YLévesque, JFMathieu, MCStocco, RTherien, ARowland, SWrona, MXu, D A novel series of potent and selective EP(4) receptor ligands: facile modulation of agonism and antagonism. Bioorg Med Chem Lett21:484-7 (2010) 
 
Prostaglandin E2 receptor EP4 subtype
Name:Prostaglandin E2 receptor EP4 subtype
Type:Enzyme
Mol. Mass.:53134.53
Organism:Homo sapiens (Human)
Description:P35408
Residue:488
BDBM50334139
NameBDBM50334139
Synonyms:(S)-4-(1-(1-(4-carbamoylbenzyl)indoline-7-carboxamido)ethyl)benzoic acid | CHEMBL1645145
TypeSmall organic molecule
Emp. Form.C26H25N3O4
Mol. Mass.443.4944
SMILESC[C@H](NC(=O)c1cccc2CCN(Cc3ccc(cc3)C(N)=O)c12)c1ccc(cc1)C(O)=O