Reaction Details
TargetProstaglandin E2 receptor EP4 subtype
LigandBDBM50334143
Substrate/Competitorn/a
Meas. Tech.ChEMBL_698179 (CHEMBL1646484)
IC50 4.7±n/a nM
Citation Boyd, MJBerthelette, CChiasson, JFClark, PColucci, JDenis, DHan, YLévesque, JFMathieu, MCStocco, RTherien, ARowland, SWrona, MXu, D A novel series of potent and selective EP(4) receptor ligands: facile modulation of agonism and antagonism. Bioorg Med Chem Lett21:484-7 (2010) 
 
Prostaglandin E2 receptor EP4 subtype
Name:Prostaglandin E2 receptor EP4 subtype
Type:Enzyme
Mol. Mass.:53134.53
Organism:Homo sapiens (Human)
Description:P35408
Residue:488
BDBM50334143
NameBDBM50334143
Synonyms:(S)-4-(1-(1-(2-bromo-4-(trifluoromethyl)benzyl)indoline-7-carboxamido)ethyl)benzoic acid | CHEMBL1645149
TypeSmall organic molecule
Emp. Form.C26H22BrF3N2O3
Mol. Mass.547.364
SMILESC[C@H](NC(=O)c1cccc2CCN(Cc3ccc(cc3Br)C(F)(F)F)c12)c1ccc(cc1)C(O)=O