Reaction Details
TargetSigma non-opioid intracellular receptor 1
LigandBDBM50334164
Substrate/Competitorn/a
Meas. Tech.ChEMBL_698206 (CHEMBL1646511)
Ki 6.8±n/a nM
Citation Maestrup, EGWiese, CSchepmann, DBrust, PWünsch, B Synthesis, pharmacological activity and structure affinity relationships of spirocyclics(1) receptor ligands with a (2-fluoroethyl) residue in 3-position. Bioorg Med Chem19:393-405 (2011) 
 
Sigma non-opioid intracellular receptor 1
Name:Sigma non-opioid intracellular receptor 1
Type:Protein
Mol. Mass.:25307.17
Organism:Cavia porcellus (Guinea pig)
Description:Q60492
Residue:223
BDBM50334164
NameBDBM50334164
Synonyms:2-[1'-(Cyclohexylmethyl)-3H-spiro[[2]benzofuran-1,4'-piperidin-3-yl])ethan-1-ol | CHEMBL1645208
TypeSmall organic molecule
Emp. Form.C21H31NO2
Mol. Mass.329.4763
SMILESOCCC1OC2(CCN(CC3CCCCC3)CC2)c2ccccc12