Reaction Details
TargetSigma non-opioid intracellular receptor 1
LigandBDBM50334173
Substrate/Competitorn/a
Meas. Tech.ChEMBL_698206 (CHEMBL1646511)
Ki 22±n/a nM
Citation Maestrup, EGWiese, CSchepmann, DBrust, PWünsch, B Synthesis, pharmacological activity and structure affinity relationships of spirocyclics(1) receptor ligands with a (2-fluoroethyl) residue in 3-position. Bioorg Med Chem19:393-405 (2011) 
 
Sigma non-opioid intracellular receptor 1
Name:Sigma non-opioid intracellular receptor 1
Type:Protein
Mol. Mass.:25307.17
Organism:Cavia porcellus (Guinea pig)
Description:Q60492
Residue:223
BDBM50334173
NameBDBM50334173
Synonyms:2-[1'-(1-phenylethyl)-3H-spiro[[2]benzofuran-1,4'-piperidin]-3-yl]acetaldehydeethylene acetal | CHEMBL1645217
TypeSmall organic molecule
Emp. Form.C23H29NO
Mol. Mass.335.4825
SMILESCCCC1OC2(CCN(CC2)C(C)c2ccccc2)c2ccccc12