Reaction Details
TargetAromatase
LigandBDBM8611
Substrate/Competitorn/a
Meas. Tech.ChEMBL_698315 (CHEMBL1646911)
IC50 30±n/a nM
Citation Zimmer, CHafner, MZender, MAmmann, DHartmann, RWVock, CA N-(Pyridin-3-yl)benzamides as selective inhibitors of human aldosterone synthase (CYP11B2). Bioorg Med Chem Lett21:186-90 (2010) 
 
Aromatase
Name:Aromatase
Type:Enzyme
Mol. Mass.:57888.92
Organism:Homo sapiens (Human)
Description:P11511
Residue:503
BDBM8611
NameBDBM8611
Synonyms:4-{5H,6H,7H,8H-imidazo[1,5-a]pyridin-5-yl}benzonitrile CHEMBL9298 US9271963, Fadrozole
TypeSmall organic molecule
Emp. Form.C14H13N3
Mol. Mass.223.2731
SMILESN#Cc1ccc(cc1)C1CCCc2cncn12