Reaction Details
TargetCalmodulin-1
LigandBDBM7461
Substrate/Competitorn/a
Meas. Tech.ChEMBL_698552 (CHEMBL1647727)
IC50 33430±n/a nM
Citation Torres-Piedra, MFigueroa, MHernández-Abreu, OIbarra-Barajas, MNavarrete-Vázquez, GEstrada-Soto, S Vasorelaxant effect of flavonoids through calmodulin inhibition: Ex vivo, in vitro, and in silico approaches. Bioorg Med Chem19:542-6 (2011) 
 
Calmodulin-1
Name:Calmodulin-1
Type:Protein
Mol. Mass.:16813.73
Organism:Human
Description:P0DP23
Residue:149
BDBM7461
NameBDBM7461
Synonyms:5,7-dihydroxy-2-phenyl-4H-chromen-4-one 5,7-dihydroxyflavone chrysin | cid_5281607
TypeSmall organic molecule
Emp. Form.C15H10O4
Mol. Mass.254.2375
SMILESOc1cc(O)c2c(c1)oc(cc2=O)-c1ccccc1