Reaction Details
TargetCalmodulin-1
LigandBDBM23419
Substrate/Competitorn/a
Meas. Tech.ChEMBL_698552 (CHEMBL1647727)
IC50 22010±n/a nM
Citation Torres-Piedra, MFigueroa, MHernández-Abreu, OIbarra-Barajas, MNavarrete-Vázquez, GEstrada-Soto, S Vasorelaxant effect of flavonoids through calmodulin inhibition: Ex vivo, in vitro, and in silico approaches. Bioorg Med Chem19:542-6 (2011) 
 
Calmodulin-1
Name:Calmodulin-1
Type:Protein
Mol. Mass.:16813.73
Organism:Human
Description:P0DP23
Residue:149
BDBM23419
NameBDBM23419
Synonyms:(2S)-5,7-dihydroxy-2-(4-hydroxyphenyl)-3,4-dihydro-2H-1-benzopyran-4-one Naringenin
Typeflavanone
Emp. Form.C15H12O5
Mol. Mass.272.2528
SMILESOc1ccc(cc1)[C@@H]1CC(=O)c2c(O)cc(O)cc2O1