Reaction Details
TargetAlpha-2A adrenergic receptor
LigandBDBM50334196
Substrate/Competitorn/a
Meas. Tech.ChEMBL_698563 (CHEMBL1647738)
EC50 14±n/a nM
Citation Saczewski, FKornicka, AHudson, ALLaird, SScheinin, MLaurila, JMRybczynska, ABoblewski, KLehmann, AGdaniec, M 3-[(Imidazolidin-2-yl)imino]indazole ligands with selectivity for thea(2)-adrenoceptor compared to the imidazoline I(1) receptor. Bioorg Med Chem19:321-9 (2011) 
 
Alpha-2A adrenergic receptor
Name:Alpha-2A adrenergic receptor
Type:Enzyme
Mol. Mass.:48979.91
Organism:Homo sapiens (Human)
Description:P08913
Residue:450
BDBM50334196
NameBDBM50334196
Synonyms:3-[(Imidazolidin-2-yl)imino]-4-methylindazole hydrochloride | CHEMBL1641682
TypeSmall organic molecule
Emp. Form.C11H13N5
Mol. Mass.215.2544
SMILESCc1cccc2n[nH]c(N=C3NCCN3)c12