Reaction Details
TargetNischarin
LigandBDBM50334206
Substrate/Competitorn/a
Meas. Tech.ChEMBL_698560 (CHEMBL1647735)
Ki 167±n/a nM
Citation Saczewski, FKornicka, AHudson, ALLaird, SScheinin, MLaurila, JMRybczynska, ABoblewski, KLehmann, AGdaniec, M 3-[(Imidazolidin-2-yl)imino]indazole ligands with selectivity for thea(2)-adrenoceptor compared to the imidazoline I(1) receptor. Bioorg Med Chem19:321-9 (2011) 
 
Nischarin
Name:Nischarin
Type:Enzyme Catalytic Domain
Mol. Mass.:166460.59
Organism:RAT
Description:Q4G017
Residue:1502
BDBM50334206
NameBDBM50334206
Synonyms:3-[(Imidazolidin-2-yl)imino]-4-methoxyindazole hydrochloride | CHEMBL1641683
TypeSmall organic molecule
Emp. Form.C11H13N5O
Mol. Mass.231.2538
SMILESCOc1cccc2n[nH]c(N=C3NCCN3)c12